{"text_format":"1","workbook":"xlsx","n_sheets":10,"sheets":["iGRC_Annex F","Impact angle inputs","Impact angle & other outputs","Frontal Area Interpolation","Ac Calculator Scenario A","Ac  Calculator Scenario B","iGRC_Scenario_A","iGRC_Scenario_B","Summary calculation","Model explanation"],"not_rendered":{"charts":5,"images":7,"macros":1,"external_links":0,"defined_names":1,"comments":0,"pivot_tables":0},"unopened":[],"bounds":{"document_bytes":16777216,"sheet_cells":100000,"rows_first":2000,"rows_last":500,"rows_between":2000,"halvings":0,"cell_chars":16384,"cell_head_chars":4096},"cells_cut":0,"cells_raw":0,"read":"whole","date_system":"1900"}

{"sheet":"iGRC_Annex F","index":0,"n_rows":45,"n_cols":2,"rows_kept":45,"cut":false,"hidden":true,"merged":[]}
[]
[]
[]
[]
[]
[]
[]
[]
[]
[]
[]
[]
[]
[]
[]
[]
[]
[]
[]
[]
{"$rows_left_out":26}
{"sheet":"Impact angle inputs","index":1,"n_rows":181,"n_cols":24,"rows_kept":181,"cut":false,"hidden":true,"merged":[[5,5,5,7]]}
[]
[null,null,null,null,null,null,null,null,null,"Time","Forward Speed","Vertical Speed","Speed Vector","Kinetic Energy [kJ]","Angle against hor [deg]","Horizontal Dist [m]","VertDistance/ Height [m]","Check Free Fall Height [m]","Gravitational Force [N]","Drag force [N]","Drag force hor [N]","Drag Force Vert [N]","Support","Support"]
[null,null,null,null,null,null,null,null,null,0,{"$f":"$D$7","v":61},0,{"$f":"SQRT(K3^2+L3^2)","v":61},{"$f":"0.5*$D$8*M3^2/1000","v":372.1},{"$f":"DEGREES(ATAN(L3/K3))","v":0},0,0,0,{"$f":"$D$8*$D$9","v":1962},{"$f":"-0.5*$D$4*M3^2*$D$5*$D$6","v":-991.86975999999981},{"$f":"COS(O3/180*PI())*T3","v":-991.86975999999981},{"$f":"T3*SIN(O3/180*PI())","v":0},{"$f":"ABS(Q3+'Impact angle & other outputs'!$C$5)","v":300},1]
[null,null,"Density",1.2250000000000001,"kg/m³",null,null,null,null,0.1,{"$f":"IF(K3+U3/$D$8*(J4-J3)<=0,0.01,K3+U3/$D$8*(J4-J3))","v":60.50406512},{"$f":"L3-(S3-V3)/$D$8*(J4-J3)","v":-0.98100000000000009},{"$f":"SQRT(K4^2+L4^2)","v":60.512017459717867},{"$f":"0.5*$D$8*M4^2/1000","v":366.17042570452003},{"$f":"DEGREES(ATAN(L4/K4))","v":-0.92890014898569206},{"$f":"(J4-J3)*0.5*(K3+K4)+P3","v":6.0752032560000009},{"$f":"Q3+0.5*(L3+L4)*(J4-J3)","v":-4.905000000000001E-2},{"$f":"J4^2*$D$9*0.5*-1","v":-4.905000000000001E-2},{"$f":"$D$8*$D$9","v":1962},{"$f":"-0.5*$D$4*M4^2*$D$5*$D$6","v":-976.06388675796825},{"$f":"COS(O4/180*PI())*T4","v":-975.93561485530006},{"$f":"T4*SIN(O4/180*PI())","v":15.823611789955208},{"$f":"ABS(Q4+'Impact angle & other outputs'!$C$5)","v":299.95094999999998},2]
[null,null,"ref Area",{"$f":"'Frontal Area Interpolation'!C7","v":0.54399999999999982},"m²",null,null,null,null,0.2,{"$f":"IF(K4+U4/$D$8*(J5-J4)<=0,0.01,K4+U4/$D$8*(J5-J4))","v":60.016097312572349},{"$f":"L4-(S4-V4)/$D$8*(J5-J4)","v":-1.9540881941050223},{"$f":"SQRT(K5^2+L5^2)","v":60.047900856753472},360.57503973024944,-1.8648574739720822,{"$f":"(J5-J4)*0.5*(K4+K5)+P4","v":12.101211377628619},{"$f":"Q4+0.5*(L4+L5)*(J5-J4)","v":-0.19580440970525112},{"$f":"J5^2*$D$9*0.5*-1","v":-0.19620000000000004},{"$f":"$D$8*$D$9","v":1962},{"$f":"-0.5*$D$4*M5^2*$D$5*$D$6","v":-961.14882590495256},{"$f":"COS(O5/180*PI())*T5","v":-960.63976665869802},{"$f":"T5*SIN(O5/180*PI())","v":31.277855623283411},{"$f":"ABS(Q5+'Impact angle & other outputs'!$C$5)","v":299.80419559029474},3]
[null,null,"Cd",{"$f":"'Summary calculation'!E13","v":0.8},"-","Drag coefficient",null,null,null,0.3,59.535777429242998,-2.9194492662933804,59.607314803829411,355.30319781228206,-2.8073579734726732,18.078805114719387,-0.43948128272517117,-0.44145000000000001,1962,-947.09620408841874,-945.95955204924837,46.386912868578762,{"$f":"ABS(Q6+'Impact angle & other outputs'!$C$5)","v":299.56051871727482},4]
[null,null,"Cruise Speed",{"$f":"'Summary calculation'!E7","v":61},"m/s","At time of termination or loss of power",null,null,null,0.4,59.062797653218375,-3.8772558098590912,59.189924642966929,350.34471792401035,-3.7558685123936715,24.008733868842455,-0.77931653653279487,-0.78480000000000016,1962,-933.87888009824189,-931.87311287463467,61.174048377435312,{"$f":"ABS(Q7+'Impact angle & other outputs'!$C$5)","v":299.2206834634672},5]
[null,null,"Aircraft Mass",{"$f":"IF(AND(D10>=20,'Summary calculation'!E8<5),5,'Summary calculation'!E8)","v":200},"kg",null,null,null,null,0.5,58.596861096781055,-4.8276687856703733,58.795395366470572,345.68985162995892,-4.7098382943690096,29.891716806342426,-1.214562766309268,-1.2262500000000001,1962,-921.47086850481833,-918.35934004619526,75.661641886367391,{"$f":"ABS(Q8+'Impact angle & other outputs'!$C$5)","v":298.78543723369074},6]
[null,null,"Gravity",9.81,"m/s²",null,null,null,null,0.6,58.137681426757958,-5.770837964727189,58.42339062819218,341.3292572494334,-5.6687004796217533,35.728443932519376,-1.7444881038291458,-1.7658,1962,-909.8472681240894,-905.39782187306332,89.871215972531175,{"$f":"ABS(Q9+'Impact angle & other outputs'!$C$5)","v":298.25551189617084},7]
[null,null,"Characteristic dimension",{"$f":"'Summary calculation'!E5","v":3.11},"m",null,null,null,null,0.7,57.684982515821424,-6.7069023567409234,58.073571847041407,337.25397470734805,-6.6318739379042038,41.51957712964834,-2.3683751199025513,-2.4034499999999999,1962,-898.98419497990676,-892.96879664992821,103.82346089998165,{"$f":"ABS(Q10+'Impact angle & other outputs'!$C$5)","v":297.63162488009743},8]
[null,null,"Flight Height",{"$f":"'Summary calculation'!E9","v":300},"m",null,null,null,null,0.8,57.238498117496462,{"$f":"L10-(S10-V10)/$D$8*(J11-J10)","v":-7.6359906262909334},57.745597404403469,333.45540195914487,-7.5987651240038687,47.265751161314242,-3.0855197690541449,-3.1392000000000007,1962,-888.85871946229645,-881.05310928488689,117.5382566809064,{"$f":"ABS(Q11+'Impact angle & other outputs'!$C$5)","v":296.91448023094586},9]
[null,null,"Friction Coeff.",0.5,null,null,null,null,null,0.9,56.797971562854016,-8.5582214979504805,57.439121936731894,329.92527288627554,-8.5687700613791016,52.967574645331766,-3.8952303752662152,-3.9730500000000006,1962,-879.44880740565588,-869.63217176321564,131.03469266428394,{"$f":"ABS(Q12+'Impact angle & other outputs'!$C$5)","v":296.10476962473376},10]
[null,null,"Height person",1.8,"m",null,null,null,null,1,56.363155476972409,-9.4737041516183389,57.153795724114033,326.65563656737555,-9.5412764177539735,58.625630997323086,-4.7968266577446563,-4.9050000000000002,1962,-870.73326483399603,-858.68792725001606,144.33108495241399,{"$f":"ABS(Q13+'Impact angle & other outputs'!$C$5)","v":295.20317334225535},11]
[null,null,"Radius person",0.3,"m",null,null,null,null,1.1000000000000001,55.933811513347401,-10.382538609142133,56.889264175070863,323.63883783810007,-10.51566565500101,64.240479346839081,-5.7896387957826807,-5.9350500000000013,1962,-862.69168614123942,-848.20281763990374,157.44499193350987,{"$f":"ABS(Q14+'Impact angle & other outputs'!$C$5)","v":294.21036120421729},12]
[null,null,null,null,null,null,null,null,null,1.2,55.50971010452745,-11.284816113175376,56.645167407263074,320.86749905968588,-11.491315234411919,69.812655427732821,-6.8730065318985547,-7.0632000000000001,1962,-855.30440549349851,-838.15975436558915,170.39322820582464,{"$f":"ABS(Q15+'Impact angle & other outputs'!$C$5)","v":293.12699346810143},13]
[null,null,null,null,null,null,null,null,null,1.3,55.090630227344654,-12.180619499072465,56.421139923145873,318.33450302272053,-12.46760085753278,75.342672444326425,-8.0462783125109478,-8.2894500000000004,1962,-848.55245125736349,-828.54209227965248,183.19187715544618,{"$f":"ABS(Q16+'Impact angle & other outputs'!$C$5)","v":291.95372168748906},14]
[null,null,null,null,null,null,null,null,null,1.4,54.67635918120483,-13.070023560494741,56.216810378960574,316.03297691840095,-13.443898722146121,80.83102191475389,-9.3088104654893069,-9.6137999999999995,1962,-842.41750327368936,-819.33360642538946,195.85630243584544,{"$f":"ABS(Q17+'Impact angle & other outputs'!$C$5)","v":290.69118953451067},15]
[null,null,null,null,null,null,null,null,null,1.5,54.266692377992136,-13.95309540927682,56.031801444786794,313.95627731480113,-14.419587772734273,86.278174492713745,-10.659966413977886,-11.036250000000001,1962,-836.88185281033373,-810.51847151360641,208.40115858244258,{"$f":"ABS(Q18+'Impact angle & other outputs'!$C$5)","v":289.34003358602212},16]
[null,null,null,null,null,null,null,null,null,1.6,53.861433142235335,-14.8298948299856,55.865729752719787,312.09797608039207,-15.39405192486246,91.684580768725127,-12.099115925941007,-12.556800000000003,1962,-831.92836503989292,-802.08124392295906,220.84040097986622,{"$f":"ABS(Q19+'Impact angle & other outputs'!$C$5)","v":287.90088407405898},17]
[null,null,null,null,null,null,null,null,null,1.7,53.460392520273857,-15.700474629495666,55.718205929598902,310.45184720131903,-16.366682243373969,97.050672051850583,-13.625634398915068,-14.17545,1962,-827.54044389983574,-794.00684604213279,233.1872953832648,{"$f":"ABS(Q20+'Impact angle & other outputs'!$C$5)","v":286.37436560108495},18]
{"$rows_left_out":162}
{"sheet":"Impact angle & other outputs","index":2,"n_rows":23,"n_cols":11,"rows_kept":23,"cut":false,"hidden":true,"merged":[[22,0,22,1]]}
[]
[null,null,null,null,null,null,"Time","Forward Speed","Kinetic Energy [kJ]","Horizontal Dist [m]","Friction force [N]"]
[null,null,null,null,null,null,0,{"$f":"$C$7","v":30.516502437894236},{"$f":"0.5*$C$17*H3^2/1000","v":93.125692104200482},0,{"$f":"$C$12*$C$17*$C$16","v":981}]
[null,null,null,null,null,null,0.5,{"$f":"H3-K3/$C$17*(G4-G3)","v":28.064002437894235},78.758823283413349,{"$f":"J3+(H3+H4)*0.5*(G4-G3)","v":14.645126218947118},981]
[null,"Flight Height",{"$f":"'Impact angle inputs'!D11","v":300},"m",null,null,1,25.611502437894234,65.594905712626229,{"$f":"J4+(H4+H5)*0.5*(G5-G4)","v":28.064002437894235},981]
[null,null,{"$f":"MIN('Impact angle inputs'!W3:W136)","v":0.76428216335199295},"m",null,null,1.5,23.159002437894234,53.6339393918391,40.25662865684135,981]
[null,"Forward Speed at crash",{"$f":"INDEX('Impact angle inputs'!K3:K136,MATCH(C6,'Impact angle inputs'!W3:W136,0))","v":30.516502437894236},"m/s",null,null,2,20.706502437894233,42.875924321051976,51.223004875788469,981]
[null,"Impact angle",{"$f":"INDEX('Impact angle inputs'!O3:O136,MATCH(C6,'Impact angle inputs'!W3:W136,0))","v":-63.479616327273341},"deg",null,null,2.5,18.254002437894233,33.320860500264864,60.963131094735587,981]
[null,"Impact energy",{"$f":"INDEX('Impact angle inputs'!N3:N136,MATCH(C6,'Impact angle inputs'!W3:W136,0))","v":467.08415421545732},"KJ",null,null,3,15.801502437894232,24.968747929477736,69.477007313682705,981]
[null,"Horizontal distance (Ballistic)",{"$f":"INDEX('Impact angle inputs'!P3:P136,MATCH(C6,'Impact angle inputs'!W3:W136,0))","v":386.63694545023304},"m",null,null,3.5,13.349002437894232,17.819586608690614,76.764633532629816,981]
[null,null,null,null,null,null,4,10.896502437894231,11.873376537903493,82.826009751576933,981]
[null,"Friction  coefficient",{"$f":"'Impact angle inputs'!D12","v":0.5},"used to calculate friction force",null,null,4.5,8.4440024378942304,7.1301177171163701,87.661135970524043,981]
[null,null,null,null,null,null,5,5.9915024378942299,3.5898101463292496,91.27001218947116,981]
[null,null,null,null,null,null,5.5,3.5390024378942297,1.25245382554213,93.652638408418269,981]
[null,null,null,null,null,null,6,1.0865024378942296,0.11804875475501042,94.809014627365386,981]
[null,"g",{"$f":"'Impact angle inputs'!D9","v":9.81},"m/s²",null,null,6.5,-1.3659975621057705,0.18659493396789084,94.739140846312495,981]
[null,"Aircraft Mass",{"$f":"'Impact angle inputs'!D8","v":200},"kg",null,null,7,-3.8184975621057706,1.4580923631807714,93.44301706525961,981]
[null,null,null,null,null,null,7.5,-6.2709975621057712,3.9325410423936522,90.920643284206719,981]
[null,null,null,null,null,null,8,-8.7234975621057718,7.6099409716065338,87.172019503153834,981]
[null,"Sliding distance",{"$f":"MAX((IF(H3:H23<=0,J3:J23)))","v":94.739140846312495},"m",null,null,8.5,-11.175997562105772,12.490292150819418,82.197145722100942,981]
{"$rows_left_out":4}
{"sheet":"Frontal Area Interpolation","index":3,"n_rows":7,"n_cols":7,"rows_kept":7,"cut":false,"hidden":true,"merged":[[0,1,0,6]]}
[null,"ANNEX F reference values"]
[null,"Characteristic dimension",1,3,8,20,40]
[null,"Frontal area",0.1,0.5,2.5,12.5,25]
[]
["INPUT","UAS characteristic dimension",{"$f":"'Summary calculation'!E5","v":3.11}]
[]
["OUTPUT","UAS corresponding frontal area",{"$f":"IF(C5<=C2, (C3/C2)*C5, IF(AND(C5>C2, C5<=D2), ((D3-C3)/(D2-C2))*C5-0.1, IF(AND(C5>D2, C5<=E2), ((E3-D3)/(E2-D2))*C5+(D3-((D3-E3)/(D2-E2))*D2), IF(AND(C5>E2,C5<=F2), ((F3-E3)/(F2-E2))*C5+(E3-((E3-F3)/(E2-F2))*E2), IF(AND(C5>F2,C5<=G2), ((G3-F3)/(G2-F2))*C5+(F3-((F3-G3)/(F2-G2))*F2),(25+0.625*(C5-40)))))))","v":0.54399999999999982}]

{"sheet":"Ac Calculator Scenario A","index":4,"n_rows":41,"n_cols":17,"rows_kept":41,"cut":false,"hidden":true,"merged":[[12,4,12,5],[23,3,23,4],[20,3,20,4],[21,3,21,4],[22,3,22,4]]}
["Fs"]
["Pi"]
["rD^2"]
["Ac"]
[]
[]
[]
[]
[]
[]
[]
[]
[null,null,null,null,"Safety factor calculation"]
[]
[]
[]
[]
[]
[]
[null,null,null,"INPUT"]
{"$rows_left_out":22}
{"sheet":"Ac  Calculator Scenario B","index":5,"n_rows":33,"n_cols":1122,"rows_kept":33,"cut":false,"hidden":true,"merged":[[1,0,1,11],[27,1,27,2],[28,1,28,2],[29,1,29,2],[30,1,30,2],[23,1,23,2],[24,1,24,2],[25,1,25,2],[26,1,26,2]]}
[]
["JARUS Mod EASA",null,null,null,null,null,null,null,null,null,null,null,null,null,null,null,null,null,null,null,null,null,null,null,null,"Glide graph",null,null,null,null,"Slide graph"]
["MTOM\n(kg)","Characteristic \nDimension (m)","Human radius\nr_h (m)","Human height\nh (m)","Impact angle \n(degree)","Glide speed OR\nCruise speed\n(m/s)","V0 (m/s)\nSlide starting speed","Dglide","Glide \ncritical area","Dslide reduced","Slide \ncritical area","Critical area total\n(obstacle reduction)",null,null,null,null,null,null,null,null,null,null,null,"y","x",null,null,null,"y","x"]
[{"$f":"'Summary calculation'!E8","v":200},{"$f":"'Summary calculation'!E5","v":3.11},{"$f":"'Summary calculation'!E15","v":0.3},1.8,{"$f":"'Summary calculation'!E29","v":60},{"$f":"IF(B4<=1,'Summary calculation'!E7,'Summary calculation'!E7*0.65)","v":39.65},{"$f":"COS((E4*PI())/180)*F4*'Summary calculation'!E16","v":15.860000000000003},{"$f":"D4/TAN((E4*PI())/180)","v":1.0392304845413267},{"$f":"(B4+2*C4)*(H4)+0.5*PI()*(((B4/2)+C4))^2","v":9.26069452805773},{"$f":"IF(B4<=1,0,SUM(E27:AQD27))","v":19.953377437499981},{"$f":"IF(J4=0,0,(B4+2*C4)*(J4)+0.5*PI()*(((B4/2)+C4))^2)","v":79.432179723534333},{"$f":"IF(OR(B4<=1,B4>20),I4+K4,(I4+K4)*'Summary calculation'!E17)","v":53.215724550955237},null,null,null,null,null,null,null,null,null,null,"a",{"$f":"D4","v":1.8},0,null,null,"a",3,0]
[null,null,null,null,null,"changed",null,null,null,null,"changed"]
[null,null,null,null,null,null,null,null,null,null,null,null,null,null,null,null,null,null,null,null,null,null,null,null,null,"b",0,{"$f":"D4/TAN((E4*PI())/180)","v":1.0392304845413267},null,null,"b",3,{"$f":"D31","v":19.953377437499981}]
[]
[]
[]
[]
[]
[]
[]
[]
[]
[]
[]
[]
[]
[]
{"$rows_left_out":14}
{"sheet":"iGRC_Scenario_A","index":6,"n_rows":10,"n_cols":13,"rows_kept":10,"cut":false,"hidden":true,"merged":[]}
["Intrisic Ground Class Value",null,null,null,null,null,null,null,null,null,null,"Dpop"]
["Max UAS Characteristic Dimension","1m","3m","8m","20m","40m",null,null,null,null,null,"Controlled"]
["Max cruise speed","25m/s","35m/s","75m/s","150m/s","200m/s",null,null,null,null,null,"< 25 ppl/km2"]
["Controlled",null,null,null,null,null,null,null,null,null,null,"< 250"]
["< 25 ppl/km2",null,null,null,null,null,null,null,null,null,null,"< 2500"]
["< 250",null,null,null,null,null,null,null,null,null,null,"< 25 000"]
["< 2500",null,null,null,null,null,null,null,null,null,null,"< 250 000",2.5000000000000001E-2]
["< 25 000",null,null,null,null,null,null,null,null,null,null,"> 250 000",2.5000000000000001E-2]
["< 250 000"]
["> 250 000"]

{"sheet":"iGRC_Scenario_B","index":7,"n_rows":0,"n_cols":0,"rows_kept":0,"cut":false,"hidden":true,"merged":[]}

{"sheet":"Summary calculation","index":8,"n_rows":31,"n_cols":6,"rows_kept":31,"cut":false,"hidden":false,"merged":[[26,1,26,5],[1,1,1,5]]}
[]
[null,"Impact angle calculator"]
[]
[]
[null,null,"INPUT","UAS characteristic dimension",3.11,"m"]
[null,null,null,"Is UA capable of gliding? (No = 1) (Yes = 0)",1]
[null,null,null,"Maximum speed / Cruise speed Vno",61,"m/s"]
[null,null,null,"Aircraft Maximum Take-Off Mass MTOM",200,"kg"]
[null,null,null,"Minimum operational flight altitude AGL",300,"m"]
[]
[null,null,"VARIABLE","Safety factor for High impact angle model",{"$f":"'Ac Calculator Scenario A'!F26","v":5.242142716163209}]
[]
[null,null,"CONSTANT","Cd (powered lift)",0.8]
[null,null,null,"Friction Coeff = μ",0.65]
[null,null,null,"Human radius",0.3,"m"]
[null,null,null,"Coefficient of Restitution CoR",{"$f":"IF(E5<=1,0.74,0.8)","v":0.8}]
[null,null,null,"Obstacle reduction",0.6]
[null,null,null,"Lethal limb KE limit",290,"J"]
[]
[null,null,"OUTPUT","Scenario A - High Impact angle model",{"$f":"IF(E6=1,'Impact angle & other outputs'!C8,0)","v":-63.479616327273341},"deg"]
{"$rows_left_out":12}
{"sheet":"Model explanation","index":9,"n_rows":2,"n_cols":28,"rows_kept":2,"cut":false,"hidden":true,"merged":[[1,27,1,32],[1,17,1,24],[1,9,1,15],[1,1,1,7],[0,6,0,17]]}
[null,null,null,null,null,null,"Used impact models for the calculation of critical area"]
[null,"Scenario A - High impact angle",null,null,null,null,null,null,null,"Definition of \"Critical area\"",null,null,null,null,null,null,null,"Scenario B - Low impact angle",null,null,null,null,null,null,null,null,null,"Safety Factor"]